﻿user.id,user.postcode,user.age,user.timeCreated,user.lastLogin,user.interventionGroup,user.gender,user.resourceUse.timeTaken,user.resourceUse.salary.stringValue,user.resourceUse.salary,user.resourceUse.visits.gp,user.resourceUse.visits.counsPsych,user.resourceUse.visits.pharmChem,user.resourceUse.visits.complementary,user.resourceUse.visits.emer,user.resourceUse.visits.eheadspace,user.resourceUse.visits.socWork,user.resourceUse.visits.other,user.resourceUse.mhOnlineTime.stringValue,user.resourceUse.internet.access.other,user.resourceUse.internet.costs.stringValue,user.resourceUse.employment.student,user.resourceUse.employment.selfEmploy,user.resourceUse.employment.volunteer,user.resourceUse.employment.unemployed,user.resourceUse.employment.homeDuties,user.resourceUse.education.fulltime,user.resourceUse.emplyment.30h,user.resourceUse.visits.OWC,user.resourceUse.appUse,user.resourceUse.mhOnline,user.resourceUse.internet.access.mobile,user.resourceUse.internet.access.tablet,user.resourceUse.internet.access.computer,priorAppUse.1GiantMind,priorAppUse.101RevolutionaryWaystoBeHealthy,priorAppUse.365HappyDays,priorAppUse.8GlassesADay,priorAppUse.Argus,priorAppUse.Balanced,priorAppUse.BeatPanic,priorAppUse.BehavioralExperimentsCBT,priorAppUse.BodywiseHealthandFitnessTracker,priorAppUse.Breathe2Relax,priorAppUse.BupaFitness,priorAppUse.CalmMeditationandRelaxation,priorAppUse.Couchto5k,priorAppUse.Dormio,priorAppUse.eCBTMood,priorAppUse.Everest,priorAppUse.GoalSetter,priorAppUse.GoodHabitMaker,priorAppUse.GratitudeJournalLifechangingApp,priorAppUse.HealthTap,priorAppUse.InstantHeartRate,priorAppUse.Juice,priorAppUse.KindnessMeditation,priorAppUse.LearnpanicCBT,priorAppUse.MindfulnessMeditation,priorAppUse.Moodkit,priorAppUse.MyCalmBeat,priorAppUse.Myquitbuddy,priorAppUse.Nikerunning,priorAppUse.Optimism,priorAppUse.Panicattackaidlite,priorAppUse.PayItForward,priorAppUse.Proof,priorAppUse.RelaxwithAndrewJohnsonLite,priorAppUse.RelaxationTechniquesCalmyourmind,priorAppUse.Riseupovercomeyoureatingdisorder,priorAppUse.SelfHelpforAnxietyManagement,priorAppUse.SmilingMind,priorAppUse.SmokeFree,priorAppUse.Spire,priorAppUse.Stoppanicandanxiety,priorAppUse.SuperBetter,priorAppUse.TalkingAnxiety,priorAppUse.Thesorter,priorAppUse.WalkWatchLite,priorAppUse.WebMD,t0.aqol.timeTaken,t0.aqol.dimensions.inliv,t0.aqol.dimensions.relat,t0.aqol.dimensions.sense,t0.aqol.dimensions.menth,t0.aqol.utilitySc,t0.aqol.items.1,t0.aqol.items.2,t0.aqol.items.3,t0.aqol.items.4,t0.aqol.items.5,t0.aqol.items.6,t0.aqol.items.7,t0.aqol.items.8,t0.aqol.items.9,t0.aqol.items.10,t0.aqol.items.11,t0.aqol.items.12,t1.aqol.timeTaken,t1.aqol.dimensions.inliv,t1.aqol.dimensions.relat,t1.aqol.dimensions.sense,t1.aqol.dimensions.menth,t1.aqol.utilitySc,t1.aqol.items.1,t1.aqol.items.2,t1.aqol.items.3,t1.aqol.items.4,t1.aqol.items.5,t1.aqol.items.6,t1.aqol.items.7,t1.aqol.items.8,t1.aqol.items.9,t1.aqol.items.10,t1.aqol.items.11,t1.aqol.items.12,t0.mhcsf.timeTaken,t0.mhcsf.score,t0.mhcsf.ewb,t0.mhcsf.swb,t0.mhcsf.pwb,t0.mhcsf.dx3,t0.mhcsf.dx2,t0.mhcsf.items.1,t0.mhcsf.items.2,t0.mhcsf.items.3,t0.mhcsf.items.4,t0.mhcsf.items.5,t0.mhcsf.items.6,t0.mhcsf.items.7,t0.mhcsf.items.8,t0.mhcsf.items.9,t0.mhcsf.items.10,t0.mhcsf.items.11,t0.mhcsf.items.12,t0.mhcsf.items.13,t0.mhcsf.items.14,t1.mhcsf.timeTaken,t1.mhcsf.score,t1.mhcsf.ewb,t1.mhcsf.swb,t1.mhcsf.pwb,t1.mhcsf.dx3,t1.mhcsf.dx2,t1.mhcsf.items.1,t1.mhcsf.items.2,t1.mhcsf.items.3,t1.mhcsf.items.4,t1.mhcsf.items.5,t1.mhcsf.items.6,t1.mhcsf.items.7,t1.mhcsf.items.8,t1.mhcsf.items.9,t1.mhcsf.items.10,t1.mhcsf.items.11,t1.mhcsf.items.12,t1.mhcsf.items.13,t1.mhcsf.items.14,t2.mhcsf.timeTaken,t2.mhcsf.score,t2.mhcsf.ewb,t2.mhcsf.swb,t2.mhcsf.pwb,t2.mhcsf.dx3,t2.mhcsf.dx2,t2.mhcsf.items.1,t2.mhcsf.items.2,t2.mhcsf.items.3,t2.mhcsf.items.4,t2.mhcsf.items.5,t2.mhcsf.items.6,t2.mhcsf.items.7,t2.mhcsf.items.8,t2.mhcsf.items.9,t2.mhcsf.items.10,t2.mhcsf.items.11,t2.mhcsf.items.12,t2.mhcsf.items.13,t2.mhcsf.items.14,t3.mhcsf.timeTaken,t3.mhcsf.score,t3.mhcsf.ewb,t3.mhcsf.swb,t3.mhcsf.pwb,t3.mhcsf.dx3,t3.mhcsf.dx2,t3.mhcsf.items.1,t3.mhcsf.items.2,t3.mhcsf.items.3,t3.mhcsf.items.4,t3.mhcsf.items.5,t3.mhcsf.items.6,t3.mhcsf.items.7,t3.mhcsf.items.8,t3.mhcsf.items.9,t3.mhcsf.items.10,t3.mhcsf.items.11,t3.mhcsf.items.12,t3.mhcsf.items.13,t3.mhcsf.items.14,toolbox.AppUse.1GiantMind,toolbox.AppUse.101RevolutionaryWaystoBeHealthy,toolbox.AppUse.365HappyDays,toolbox.AppUse.8GlassesADay,toolbox.AppUse.Argus,toolbox.AppUse.Balanced,toolbox.AppUse.BeatPanic,toolbox.AppUse.BehavioralExperimentsCBT,toolbox.AppUse.BodywiseHealthandFitnessTracker,toolbox.AppUse.Breathe2Relax,toolbox.AppUse.BupaFitness,toolbox.AppUse.CalmMeditationandRelaxation,toolbox.AppUse.Couchto5k,toolbox.AppUse.Dormio,toolbox.AppUse.eCBTMood,toolbox.AppUse.Everest,toolbox.AppUse.GoalSetter,toolbox.AppUse.GoodHabitMaker,toolbox.AppUse.GratitudeJournalLifechangingApp,toolbox.AppUse.HealthTap,toolbox.AppUse.InstantHeartRate,toolbox.AppUse.Juice,toolbox.AppUse.KindnessMeditation,toolbox.AppUse.LearnpanicCBT,toolbox.AppUse.MindfulnessMeditation,toolbox.AppUse.Moodkit,toolbox.AppUse.MyCalmBeat,toolbox.AppUse.Myquitbuddy,toolbox.AppUse.Nikerunning,toolbox.AppUse.Optimism,toolbox.AppUse.Panicattackaidlite,toolbox.AppUse.PayItForward,toolbox.AppUse.Proof,toolbox.AppUse.RelaxwithAndrewJohnsonLite,toolbox.AppUse.RelaxationTechniquesCalmyourmind,toolbox.AppUse.Riseupovercomeyoureatingdisorder,toolbox.AppUse.SelfHelpforAnxietyManagement,toolbox.AppUse.SmilingMind,toolbox.AppUse.SmokeFree,toolbox.AppUse.Spire,toolbox.AppUse.Stoppanicandanxiety,toolbox.AppUse.SuperBetter,toolbox.AppUse.TalkingAnxiety,toolbox.AppUse.Thesorter,toolbox.AppUse.WalkWatchLite,toolbox.AppUse.WebMD,toolbox.goals.individual.Behealthier,toolbox.goals.individual.Boostfitness,toolbox.goals.individual.Increaseenergy,toolbox.goals.individual.Quitsmoking,toolbox.goals.individual.Sleepbetter,toolbox.goals.individual.Achievebalance,toolbox.goals.individual.Achievegoals,toolbox.goals.individual.Betterhabits,toolbox.goals.individual.Embracechallenges,toolbox.goals.individual.Enhanceconcentration,toolbox.goals.individual.Learnskills,toolbox.goals.individual.Managemoney,toolbox.goals.individual.Bekinder,toolbox.goals.individual.Helpothers,toolbox.goals.individual.Inproverelationships,toolbox.goals.individual.Enjoylife,toolbox.goals.individual.Improvegeneralwellbeing,toolbox.goals.individual.Increasehappiness,toolbox.goals.individual.Manageanger,toolbox.goals.individual.Managestress,toolbox.goals.individual.Overcomefears,toolbox.goals.individual.Relax,toolbox.goals.individual.Staypositive,toolbox.goals.individual.Beresilient,toolbox.goals.individual.Controlpanicattacks,toolbox.goals.individual.Manageanxiety,toolbox.goals.individual.Managedepression,toolbox.goals.individual.Manageeatingdisorders,toolbox.goals.category.BeingIndependent,toolbox.goals.category.DealingToughTimes,toolbox.goals.category.HealthFitness,toolbox.goals.category.RelationshipsHelpingOthers,toolbox.goals.category.ThoughtsEmotions,user.recruitment.paid,user.recruitment.channel
1000,5126,20,2014-12-02 11:23:50.153,2015-04-27 02:38:00,0,1, , , , , , , , , , , , , , , , , , , , , , , , , , , ,0,0,0,0,0,0,0,0,0,0,0,0,0,0,0,0,0,0,0,0,0,0,0,0,0,0,0,0,0,0,0,0,0,0,0,0,0,0,0,0,0,0,0,0,0,1, , , , , , , , , , , , , , , , , , , , , , , , , , , , , , , , , , , , ,2014-12-02 11:27:04.807,3.42857142857143,4,3.2,3.33333333333333,2,1,4,4,4,2,4,3,3,4,4,4,4,4,2,2, , , , , , , , , , , , , , , , , , , , , , , , , , , , , , , , , , , , , , , , , , , , , , , , , , , , , , , , , , , , , , , , , , , , , , , , , , , , , , , , , , , , , , , , , , , , , , , , , , , , , , , , , , , , , , , , , , , , , , , , , , , , , , , , , , , , , , , , , ,0,0,0,0,0, , 
1001,5171,24,2014-12-02 11:51:27.599,2015-07-13 03:04:00,1,1, , , , , , , , , , , , , , , , , , , , , , , , , , , ,0,0,0,0,0,0,0,0,0,0,0,0,0,0,0,0,0,0,0,0,0,0,0,0,0,0,0,0,1,0,0,0,0,0,0,0,0,0,0,0,0,0,0,0,0,0,2015-04-13 05:34:51.937,1,.93825006175,.87737666152,.911988224779209,.756060116423684,1,1,1,1,2,1,1,1,2,2,3,1, , , , , , , , , , , , , , , , , , ,2014-12-02 23:19:28.003,3.14285714285714,4,2.2,3.5,2,1,4,4,4,4,4,1,1,1,2,2,4,4,4,5,2015-02-08 03:35:02.82,2.92857142857143,4,2,3.16666666666667,1,0,4,4,4,3,3,1,2,1,3,2,4,3,3,4,2015-04-13 05:31:27.673,3.35714285714286,4,2.8,3.5,1,0,4,4,4,4,4,2,2,2,3,3,4,3,4,4,2015-07-13 03:05:15.941,3.28571428571429,4,2.6,3.5,1,0,4,4,4,3,4,2,2,2,3,3,4,3,4,4, , , , , , , , , , , , , , , , , , , , , , , , , , , , , , , , , , , , , , , , , , , , , , , , , , , , , , , , , , , , , , , , , , , , , , , , , , ,0,0,0,0,0,0,4
1002,5047,20,2014-12-02 12:11:47.011,2015-09-14 12:31:00,1,1, , , , , , , , , , , , , , , , , , , , , , , , , , , ,0,0,0,0,0,0,0,0,0,0,0,0,0,0,0,0,0,0,0,0,0,0,0,0,0,0,0,0,0,0,0,0,0,0,0,0,0,0,0,0,0,0,0,0,0,0, , , , , , , , , , , , , , , , , , , , , , , , , , , , , , , , , , , , ,2014-12-02 12:17:27.427,1.42857142857143,3.66666666666667,.6,1,1,0,3,5,3,1,0,1,0,1,0,0,1,1,2,2, , , , , , , , , , , , , , , , , , , , , , , , , , , , , , , , , , , , , , , , , , , , , , , , , , , , , , , , , , , , , , , , , , , , , , , , , , , , , , , , , , , , , , , , , , , , , , , , , , , , , , , , , , , , , , , , , , , , , , , , , , , , , , , , , , , , , , , , , ,0,0,0,0,0,0,4
1003, , ,2014-12-02 13:11:10.918, , , , , , , , , , , , , , , , , , , , , , , , , , , , , , ,0,0,0,0,0,0,0,0,0,0,0,0,0,0,0,0,0,0,0,0,0,0,0,0,0,0,0,0,0,0,0,0,0,0,0,0,0,0,0,0,0,0,0,0,0,0, , , , , , , , , , , , , , , , , , , , , , , , , , , , , , , , , , , , , , , , , , , , , , , , , , , , , , , , , , , , , , , , , , , , , , , , , , , , , , , , , , , , , , , , , , , , , , , , , , , , , , , , , , , , , , , , , , , , , , , , , , , , , , , , , , , , , , , , , , , , , , , , , , , , , , , , , , , , , , , , , , , , , , , , , , , , , , , , , , , , , , , , , , , , , , , , , , ,0,0,0,0,0, , 
1004,5090,21,2014-12-02 14:29:41.335,2015-02-16 14:30:00,1,1, , , , , , , , , , , , , , , , , , , , , , , , , , , ,0,0,0,0,0,0,0,0,0,0,0,0,0,0,0,0,0,0,0,0,0,0,0,0,0,0,0,0,0,0,0,0,0,0,0,0,0,0,0,0,0,0,0,0,0,1, , , , , , , , , , , , , , , , , , , , , , , , , , , , , , , , , , , , ,2014-12-02 14:34:18.615,3,3.66666666666667,2.4,3.16666666666667,1,0,4,4,3,2,1,1,4,4,4,1,4,3,2,5,2015-02-07 15:37:36.599,3.92857142857143,4.33333333333333,4,3.66666666666667,2,1,5,4,4,4,3,3,5,5,4,3,5,1,4,5, , , , , , , , , , , , , , , , , , , , , , , , , , , , , , , , , , , , , , , , , , , , , , , , , , , , , , , , , , , , , , , , , , , , , , , , , , , , , , , , , , , , , , , , , , , , , , , , , , , , , , , , , , , , , , , , , , , , ,0,0,0,0,0,0,4
1005,5126,20,2014-12-02 20:17:25.181,2015-08-31 01:45:00,0,1, , , , , , , , , , , , , , , , , , , , , , , , , , , ,0,0,0,0,0,0,0,0,0,0,0,0,0,0,0,0,0,0,0,0,0,0,0,0,0,0,0,0,0,0,0,0,0,0,0,0,0,0,0,0,0,0,0,0,0,0,2015-08-31 01:46:52.351,1,1,1,1,1,1,1,1,1,1,1,1,1,1,1,1,1, , , , , , , , , , , , , , , , , , ,2014-12-02 22:48:01.352,3.85714285714286,4.33333333333333,2.4,4.83333333333333,2,1,5,4,4,3,5,1,2,1,4,5,5,5,5,5,2015-08-10 02:15:27.072,4.57142857142857,5,4,4.83333333333333,2,1,5,5,5,5,5,3,4,3,4,5,5,5,5,5, , , , , , , , , , , , , , , , , , , , , , , , , , , , , , , , , , , , , , , , , , , , , , , , , , , , , , , , , , , , , , , , , , , , , , , , , , , , , , , , , , , , , , , , , , , , , , , , , , , , , , , , , , , , , , , , , , , , ,0,0,0,0,0,0,4
1006,5266,21,2014-12-02 21:28:16.736,2015-04-20 13:10:00,0,0, , , , , , , , , , , , , , , , , , , , , , , , , , , ,0,0,0,0,0,0,0,0,0,0,0,0,0,0,0,0,0,0,0,0,0,0,0,0,0,0,0,0,0,0,0,0,0,0,0,0,0,0,0,0,0,0,0,0,0,0,2015-04-20 13:13:30.772,1,.822202177995973,.783847680908038,.9534732712,.63175361039786,1,1,1,2,2,1,2,3,1,1,2,1, , , , , , , , , , , , , , , , , , ,2014-12-02 21:35:31.69,2.57142857142857,2,3.2,2.33333333333333,1,0,3,1,2,2,3,4,5,2,5,4,1,2,2,0,2015-01-26 08:38:47.192,3.21428571428571,3,3.6,3,2,1,4,3,2,3,5,1,5,4,4,4,2,3,4,1,2015-03-25 23:09:01.493,2.14285714285714,2,1,3.16666666666667,1,0,2,3,1,0,1,0,1,3,4,2,3,5,4,1, , , , , , , , , , , , , , , , , , , , , , , , , , , , , , , , , , , , , , , , , , , , , , , , , , , , , , , , , , , , , , , , , , , , , , , , , , , , , , , , , , , , , , , , , , , , , , , ,0,0,0,0,0,0,4
1008,5044,20,2014-12-02 22:39:25.885,2015-05-11 12:17:00,1,1, , , , , , , , , , , , , , , , , , , , , , , , , , , ,0,0,0,0,0,0,0,0,0,0,0,0,0,0,0,0,0,0,0,0,0,0,0,0,0,0,0,0,1,0,0,0,0,0,0,0,0,0,0,0,0,0,0,0,0,0,2015-05-11 12:19:10.646,1,.822202177995973,.822339733418109,.930778132704867,.645237247804211,1,1,1,2,2,1,2,1,2,2,2,1, , , , , , , , , , , , , , , , , , ,2014-12-03 21:42:39.046,3,3.66666666666667,2.4,3.16666666666667,1,0,4,4,3,3,2,2,2,3,2,5,3,4,3,2,2015-05-11 04:43:42.5,2.35714285714286,3.66666666666667,2.2,1.83333333333333,1,0,4,4,3,2,3,3,2,1,2,2,1,2,1,3, , , , , , , , , , , , , , , , , , , , , , , , , , , , , , , , , , , , , , , , , , , , , , , , , , , , , , , , , , , , , , , , , , , , , , , , , , , , , , , , , , , , , , , , , , , , , , , , , , , , , , , , , , , , , , , , , , , , ,0,0,0,0,0,0,4
1009,5048,23,2014-12-02 23:32:20.77,2015-09-21 23:08:00,0,1, , , , , , , , , , , , , , , , , , , , , , , , , , , ,0,0,0,0,0,0,0,0,0,0,0,0,0,0,0,0,0,0,0,0,0,0,0,0,0,0,0,0,1,0,0,0,0,0,0,0,0,0,0,0,0,0,0,0,0,0,2015-04-06 01:42:17.861,.738315104119158,.688490930821634,.87737666152,.849667808776586,.408139812828249,2,3,1,2,3,2,1,1,2,3,2,2,2015-09-21 23:12:26.241,.87556012444,.738118485850175,.822339733418109,.832514406847403,.462421679894536,1,2,1,2,2,2,2,1,2,2,3,2,2014-12-03 23:39:02.348,2.92857142857143,3.33333333333333,2.2,3.33333333333333,1,0,3,3,4,1,1,2,4,3,3,3,4,3,3,4,2015-04-06 01:37:03.062,2.28571428571429,3.33333333333333,1.2,2.66666666666667,1,0,4,3,3,2,1,0,1,2,2,1,3,3,4,3,2015-06-14 12:09:15.465,2.42857142857143,3,1.8,2.66666666666667,1,0,3,4,2,3,2,1,2,1,2,1,4,5,2,2,2015-09-21 23:10:17.745,2.57142857142857,2.33333333333333,2.4,2.83333333333333,1,0,3,2,2,1,4,1,4,2,3,2,3,4,2,3, , , , , , , , , , , , , , , , , , , , , , , , , , , , , , , , , , , , , , , , , , , , , , , , , , , , , , , , , , , , , , , , , , , , , , , ,1, , ,0,1,0,0,0,0,10
1011,5162,27,2014-12-03 00:18:54.436,2014-12-03 00:21:00,0,1, , , , , , , , , , , , , , , , , , , , , , , , , , , ,0,0,0,0,0,0,0,0,0,0,1,0,1,0,0,0,0,0,0,0,0,0,0,0,0,0,0,0,0,0,0,0,0,0,0,0,0,0,0,0,0,0,0,0,0,1, , , , , , , , , , , , , , , , , , , , , , , , , , , , , , , , , , , , ,2014-12-03 00:22:50.72,4.21428571428571,4.33333333333333,3.8,4.5,2,1,4,5,4,3,4,4,4,4,4,5,5,5,4,4, , , , , , , , , , , , , , , , , , , , , , , , , , , , , , , , , , , , , , , , , , , , , , , , , , , , , , , , , , , , , , , , , , , , , , , , , , , , , , , , , , , , , , , , , , , , , , , , , , , , , , , , , , , , , , , , , , , , , , , , , , , , , , , , , , , , , , , , , ,0,0,0,0,0,0,4
1012,5047,22,2014-12-03 02:42:37.165,2015-04-14 03:41:00,1,1, , , , , , , , , , , , , , , , , , , , , , , , , , , ,0,0,0,0,0,0,0,0,0,0,0,0,0,0,0,0,0,0,0,0,0,0,0,0,0,0,0,0,0,0,0,0,0,0,0,0,0,0,0,0,0,0,0,0,0,1, , , , , , , , , , , , , , , , , , , , , , , , , , , , , , , , , , , , ,2014-12-03 02:47:58.615,2.35714285714286,4,1.8,2,1,0,4,4,4,0,0,3,3,3,4,5,2,0,0,1,2015-04-14 03:43:48.696,2.71428571428571,4,2.8,2,1,0,4,4,4,3,3,2,4,2,4,3,3,1,0,1, , , , , , , , , , , , , , , , , , , , , , , , , , , , , , , , , , , , , , , , , , , , , , , , , , , , , , , , , , , , , , , , , , , , , , , , , , , , , , , , , , , , , , , , , , , , , , , , , , , , , , , , , , , , , , , , , , , , ,0,0,0,0,0,0,4
1013,5043,22,2014-12-03 08:18:08.346,2015-05-11 03:34:00,0,1,7/04/16, , ,0,2,2,0,0,0,0, ,30mins, ,45,1,0,1,0,0,0,2,2,3,3,1,0,1,0,0,0,0,0,0,0,0,0,0,0,0,0,0,0,0,0,0,0,0,0,0,0,0,0,0,0,0,0,0,0,0,0,0,0,0,0,0,0,0,0,0,0,0,0,0,2015-03-09 06:36:36.821,1,.738118485850175,.91396475928,.832124288464241,.578213245598398,1,1,1,2,2,2,1,2,1,3,3,2, , , , , , , , , , , , , , , , , , ,2014-12-03 08:25:59.306,3.35714285714286,4.33333333333333,2.6,3.5,1,0,4,5,4,5,2,1,1,4,4,3,3,3,4,4,2015-01-15 06:06:48.079,3.07142857142857,3.33333333333333,3,3,1,0,3,3,4,4,3,2,2,4,4,2,3,4,2,3,2015-03-18 05:41:18.783,3.35714285714286,3.66666666666667,2.8,3.66666666666667,1,0,4,4,3,4,3,2,2,3,4,4,3,4,4,3, , , , , , , , , , , , , , , , , , , , , ,1, , , , , , , , , , , , , , , , , , , , ,1, , , , , , , , , , , , , , , , , , , , , , , , ,1, , , , , , , , , , , , , , , , , , ,1, , , , , , , , ,0,0,1,0,1,0,4
1014,5034,22,2014-12-03 13:06:16.017,2015-07-06 02:40:00,1,1,7/04/16, , ,0,I wanted to go but they deleted my referral.,0,0,0,0,0,0, , , ,1,1,1,0,0,0,2,2,4,5,1,0,1,0,0,0,0,0,0,0,0,0,0,1,0,1,0,0,0,0,0,0,0,0,0,0,0,0,0,0,0,0,0,0,0,0,0,0,0,0,0,0,0,0,0,0,0,0,1,2015-03-07 01:37:14.656,.784064360407855,.652318799987116,1,.871261075136013,.481349349890768,2,2,1,2,2,3,1,1,1,1,2,2, , , , , , , , , , , , , , , , , , ,2014-12-03 13:15:14.359,2.21428571428571,3.33333333333333,2.2,1.66666666666667,1,0,4,3,3,1,3,3,4,0,1,0,1,4,1,3,2015-01-07 03:52:36.376,3.35714285714286,4,3.4,3,2,1,4,4,4,4,3,4,4,2,4,4,2,3,1,4,2015-03-07 01:34:05.782,3.92857142857143,4.33333333333333,4,3.66666666666667,2,1,5,4,4,5,5,3,5,2,4,4,3,3,4,4, , , , , , , , , , , , , , , , , , , , , , , , , , , , , , , , , , , , , , , , , , , , , , , , , , , , , , , , , , , , , , , , , , , , , , , , , , , , , , , , , , , , , , , , , , , , , , , ,0,0,0,0,0,0,4
1015,5171,22,2014-12-03 13:29:56.49,2015-07-06 01:37:00,0,1, , , , , , , , , , , , , , , , , , , , , , , , , , , ,0,0,0,0,0,0,0,0,0,0,0,0,0,0,0,0,0,0,0,0,0,0,0,0,0,0,0,0,0,0,0,0,0,0,0,0,0,0,0,0,0,0,0,0,0,0, , , , , , , , , , , , , , , , , , , , , , , , , , , , , , , , , , , , ,2014-12-03 13:35:44.332,1.92857142857143,2.66666666666667,1.2,2.16666666666667,1,0,3,3,2,1,1,0,1,3,2,3,2,3,2,1,2015-07-06 01:38:53.852,2.35714285714286,2.66666666666667,1.6,2.83333333333333,1,0,3,3,2,1,1,1,2,3,3,3,3,3,3,2, , , , , , , , , , , , , , , , , , , , , , , , , , , , , , , , , , , , , , , , , , , , , , , , , , , , , , , , , , , , , , , , , , , , , , , , , , , , , , , , , , , , , , , , , , , , , , , , , , , , , , , , , , , , , , , , , , , , ,0,0,0,0,0,0,4
1018,5051,21,2014-12-05 20:51:15.798,2015-04-13 02:29:00,1,0, , , , , , , , , , , , , , , , , , , , , , , , , , , ,0,0,0,0,0,0,0,0,0,0,0,0,0,0,0,0,0,0,0,0,0,0,0,0,0,0,0,0,0,0,0,0,0,0,0,0,0,0,0,0,0,0,0,0,0,0,2015-03-07 21:07:52.328,1,.767208407869798,1,.9534732712,.754361141869461,1,1,1,2,3,1,1,1,1,1,2,1, , , , , , , , , , , , , , , , , , ,2014-12-05 21:03:13.91,2.78571428571429,2.33333333333333,1.6,4,1,0,2,5,0,0,3,0,5,0,5,5,3,4,5,2,2015-01-06 10:18:23.035,2.07142857142857,2.33333333333333,.2,3.5,0,0,3,4,0,0,1,0,0,0,5,5,2,4,5,0,2015-03-07 21:03:37.345,2.35714285714286,2,1.2,3.5,0,0,3,3,0,0,1,0,5,0,5,5,1,5,5,0, , , , , , , , , , , , , , , , , , , , , , , , , , , , , , , , , , , , , , , , , , , , , , , , , , , , , , , , , , , , , , , , , , , , , , , , , , , , , , , , , , , , , , , , , , , , , , , ,0,0,0,0,0,0,4
1019,2117,22,2014-12-07 00:48:48.19,2015-04-06 02:19:00,0,1,10/04/16, , ,0,0,0,0,0,0,0,0, , , ,0,1,0,0,0,0,1,3,0,5,1,0,1,0,0,0,0,0,0,0,0,0,0,0,0,0,0,0,0,0,0,0,0,0,0,0,0,0,0,0,0,0,0,0,0,0,0,0,0,0,0,0,0,0,0,0,0,0,1,2015-04-06 01:42:35.685,1,.688490930821634,1,.832124288464241,.595300208345863,1,1,1,2,3,2,1,1,1,3,3,2, , , , , , , , , , , , , , , , , , ,2014-12-07 00:54:25.562,2.42857142857143,3.33333333333333,1.8,2.5,1,0,4,3,3,2,2,1,1,3,1,3,3,2,3,3,2015-02-02 02:09:07.648,.214285714285714,1,0,0,0,0,1,2,0,0,0,0,0,0,0,0,0,0,0,0,2015-04-06 01:39:34.838,.642857142857143,1.33333333333333,.6,.333333333333333,0,0,2,1,1,0,0,0,1,2,1,0,1,0,0,0, , , , , , , , , , , , , , , , , , , , , , , , , , , , , , , , , , , , , , , , , , , , , , , , , , , , , , , , , , , , , , , , , , , , , , , , , , , , , , , , , , , , , , , , , , , , , , , ,0,0,0,0,0,0,0
1020,5352,25,2014-12-07 21:57:39.682,2015-09-14 01:59:00,1,1,9/04/16,1400,1400,0,0,0,0,0,0,0,0,Not applicable, ,59,0,1,0,0,0,2,1,2,2,5,1,0,1,0,0,0,0,0,1,0,0,0,0,0,0,0,0,0,0,0,0,0,0,0,0,0,0,0,0,0,0,0,0,0,0,0,0,0,0,0,1,0,0,0,0,0,1,0,1,2015-05-25 11:33:23.316,1,.35000065,1,.9534732712,.4005887607667,1,1,1,1,4,1,1,1,1,1,2,1, , , , , , , , , , , , , , , , , , ,2014-12-07 22:04:11.375,3.14285714285714,4,2.4,3.33333333333333,1,0,4,4,4,2,3,1,3,3,4,3,3,4,4,2,2015-01-07 22:37:02.896,3.42857142857143,3,3.4,3.66666666666667,1,0,3,3,3,2,4,2,5,4,4,3,5,2,5,3,2015-03-12 03:02:48.526,3.64285714285714,4,2.8,4.16666666666667,2,1,4,4,4,3,4,1,4,2,4,4,4,4,5,4,2015-09-14 02:01:25.08,3.64285714285714,3.66666666666667,3,4.16666666666667,2,1,4,4,3,3,4,1,4,3,5,3,5,4,5,3, , , , , , , , , , , , , , , , , , , , , ,1, , , , , , , , , , , , , , , , , , , , , ,1, , , , , , , , , , , , , , , , , , , , , ,1, , , , , , , , ,0,0,0,0,1,0,10
1021,820,23,2014-12-08 02:13:09.735,2014-12-08 02:16:00,0,1, , , , , , , , , , , , , , , , , , , , , , , , , , , ,0,0,0,0,0,0,0,0,0,0,0,0,1,0,0,0,0,0,0,0,0,0,0,0,0,0,0,0,0,0,0,0,0,0,0,0,0,1,0,0,0,0,0,0,0,0, , , , , , , , , , , , , , , , , , , , , , , , , , , , , , , , , , , , ,2014-12-08 02:17:09.273,4.78571428571429,5,4.6,4.83333333333333,2,1,5,5,5,5,5,4,5,4,5,4,5,5,5,5, , , , , , , , , , , , , , , , , , , , , , , , , , , , , , , , , , , , , , , , , , , , , , , , , , , , , , , , , , , , , , , , , , , , , , , , , , , , , , , , , , , , , , , , , , , , , , , , , , , , , , , , , , , , , , , , , , , , , , , , , , , , , , , , , , , , , , , , , ,0,0,0,0,0, , 
1022,3056,26,2014-12-08 04:20:06.125,2015-09-14 01:48:00,1,1, , , , , , , , , , , , , , , , , , , , , , , , , , , ,0,0,0,0,0,0,0,0,0,0,0,0,0,0,0,0,0,0,0,0,0,0,0,0,0,0,0,0,0,0,0,0,0,0,0,0,0,0,0,0,0,0,0,0,0,0,2015-05-15 04:09:48.092,1,.787229087180502,.85761424529233,.850064015498778,.58769667496097,1,1,1,2,1,2,2,2,1,2,2,2, , , , , , , , , , , , , , , , , , ,2014-12-08 04:23:45.307,3.42857142857143,4,3.2,3.33333333333333,1,0,4,4,4,3,3,3,4,3,3,5,4,2,3,3,2015-05-15 04:07:09.967,3.35714285714286,3.66666666666667,3,3.5,1,0,3,5,3,4,4,2,3,2,5,3,3,2,4,4, , , , , , , , , , , , , , , , , , , , , , , , , , , , , , , , , , , , , , , , , , , , , , , , , , , , , , , , , , , , , , , , , , , , , , , , , , , , , , , , , , , , , , , , , , , , , , , , , , , , , , , , , , , , , , , , , , , , ,0,0,0,0,0,0,0
1023,3070,27,2014-12-08 04:34:03.762,2015-05-06 06:12:00,0,0, , , , , , , , , , , , , , , , , , , , , , , , , , , ,0,0,0,0,0,0,0,0,0,0,0,0,0,0,0,0,0,0,0,0,0,0,0,0,0,0,0,0,0,0,0,0,0,0,0,0,0,1,0,0,0,0,0,0,0,0,2015-02-16 03:20:46.044,1,.842842579574522,1,.911988224779209,.781260225620545,1,1,1,1,2,2,1,1,1,2,3,1, , , , , , , , , , , , , , , , , , ,2014-12-08 04:37:04.868,3.28571428571429,3.33333333333333,3.2,3.33333333333333,1,0,3,4,3,3,4,3,3,3,2,3,5,3,3,4,2015-01-15 01:12:47.899,3.21428571428571,3.33333333333333,3,3.33333333333333,1,0,3,4,3,3,3,3,4,2,3,2,3,4,4,4,2015-03-15 22:05:25.338,2.78571428571429,3,3,2.5,1,0,3,3,3,3,3,3,4,2,3,2,3,2,3,2, , , , , , , , , , , , , , , , , , , , , , , , , , , , , , , , , , , , , , , , , , , , , , , , , , , , , , , , , , , , , , , , , , , , , , , , , , , , , , , , , , , , , , , , , , , , , , , ,0,0,0,0,0,0,0
1033,5114,20,2014-12-09 08:58:31.788,2014-12-10 09:31:00,0,1, , , , , , , , , , , , , , , , , , , , , , , , , , , ,0,0,0,0,0,0,0,0,0,0,0,0,0,0,0,0,0,0,0,0,0,0,0,0,0,0,0,0,0,0,0,0,0,0,0,0,0,0,0,0,0,0,0,0,0,0, , , , , , , , , , , , , , , , , , , , , , , , , , , , , , , , , , , , ,2014-12-09 09:04:43.652,.857142857142857,1.33333333333333,.8,.666666666666667,0,0,1,2,1,0,1,1,1,1,2,1,1,0,0,0,2015-05-11 06:51:52.168,2.78571428571429,4,1.4,3.33333333333333,1,0,4,4,4,2,2,1,1,1,4,4,4,2,4,2, , , , , , , , , , , , , , , , , , , , , , , , , , , , , , , , , , , , , , , , , , , , , , , , , , , , , , , , , , , , , , , , , , , , , , , , , , , , , , , , , , , , , , , , , , , , , , , , , , , , , , , , , , , , , , , , , , , , ,0,0,0,0,0,0,9